concepts
type: Collection
type: ConceptGroup
member: food distribution systems

disaster relief methods and practices
type: Concept
narrower: food distribution systems

food distribution systems
type: Concept
broader: disaster relief methods and practices
definition: One of the most immediate needs following a natural disaster or crisis situation is access to adequate and appropriate food. A network of organizations is mobilized to assist in food procurement and distribution after an extreme event. [Source: Encyclopedia of Disaster Relief; Food Distribution Systems]