concepts
type: Collection
type: ConceptGroup
member: game-theoretic modeling

game-theoretic modeling
type: Concept
broader: logic and social science
definition: This entry exemplifies the process by which models of strategic behavior are constructed (requiring a modicum of mathematics for a full appreciation). Strategic behavior arises when the outcome of an individual's actions depends on actions taken by other individuals. [Source: Encyclopedia of Philosophy and the Social Sciences; Game-Theoretic Modeling]

logic and social science
type: Concept
narrower: game-theoretic modeling