concepts
type: Collection
type: ConceptGroup
member: garbage

garbage
type: Concept
broader: refuse disposal
definition: Garbage is both obvious and difficult to define. We know it when we see it, but how is it different from other objects? The technical definition of garbage is “the offal of an animal used for food,” but it has also come to mean refuse in general. [Source: Encyclopedia of Environment and Society; Garbage]

refuse disposal
type: Concept
narrower: garbage