methods
type: Collection
type: ConceptGroup
member: genealogical research

genealogical research
type: Concept
broader: inquiry and research
definition: Genealogical research is a critical and postmodern approach to historical inquiry. In curriculum studies, the term genealogy is sometimes used to mean the same thing as history. [Source: Encyclopedia of Curriculum Studies; Genealogical Research]

inquiry and research
type: Concept
narrower: genealogical research