concepts
type: Collection
type: ConceptGroup
member: geography and class

geography and class
type: Concept
broader: social geography
definition: There has been somewhat of a resurgence of interest in class across disciplines, for example, in feminist theory, sociology, and geography. In the United States, there have been several rich, ethnographic accounts of the continued effect of social class, as it intersects with other social positions, all of which challenge the popular myth of North America as a classless society. [Source: Encyclopedia of Geography; Class, Geography and]

social geography
type: Concept
narrower: geography and class