concepts
type: Collection
type: ConceptGroup
member: geography and masculinity

geography and masculinity
type: Concept
broader: social geography
definition: Masculinity is a concept that first and foremost implies that how men and women live and practice their lives is dependent on gender relations. Within these relations, masculinities take place and are expressed through practices that, according to Robert Connell, affect experience, personality, and culture. [Source: Encyclopedia of Geography; Masculinities and Geography]

social geography
type: Concept
narrower: geography and masculinity