concepts
type: Collection
type: ConceptGroup
member: geography of communications

geography of communications
type: Concept
broader: social geography
definition: There is no process in human geography, whether economic, political, or cultural, that does not depend on communication in extensive and important ways. Communications are flows of ideas and information through space and time. [Source: Encyclopedia of Human Geography; Communications, Geography of]

social geography
type: Concept
narrower: geography of communications