methods
type: Collection
type: ConceptGroup
member: geomatics

geomatics
type: Concept
broader: organizational and institutional aspects
definition: Geomatics is the science of building efficient earthrelated data production workflows. Such workflows go from initial measurements using diverse technologies to the processing and dissemination of these data in various formats: maps, geospatial databases, field coordinates, spatial statistics, aerial images, and so on. [Source: Encyclopedia of Geographic Information Science; Geomatics]

organizational and institutional aspects
type: Concept
narrower: geomatics