concepts
type: Collection
type: ConceptGroup
member: geoslavery

geoslavery
type: Concept
broader: social geography
definition: Geoslavery is a radically new form of human bondage characterized by location control via electronic tracking devices. Formally, it is defined as a practice in which one entity (the master) coercively or surreptitiously monitors and exerts control over the physical location of another individual (the slave). [Source: Encyclopedia of Human Geography; Geoslavery]

social geography
type: Concept
narrower: geoslavery