concepts
type: Collection
type: ConceptGroup
member: geospatial semantic web

geographic information systems
type: Concept
narrower: geospatial semantic web

geospatial semantic web
type: Concept
broader: geographic information systems
definition: The term geospatial semantic web has been coined to describe the convergence of three distinct concepts in computing and geographic information science. The first is a geospatial web composed of geospatial information Web services. [Source: Encyclopedia of Geography; Geospatial Semantic Web]