concepts
type: Collection
type: ConceptGroup
member: global value/commodity chains

global economic issues
type: Concept
narrower: global value/commodity chains

global value/commodity chains
type: Concept
broader: global economic issues
definition: A commodity's global network of production and consumption, the actors and resources involved, and the places it connects around the world are the subjects of global value chain analysis and commodity chain analysis. The purpose of this entry is to compare the two perspectives, show where they come from, and describe what they can contribute to the field of global studies. [Source: Encyclopedia of Global Studies; Value/Commodity Chains, Global]