concepts
type: Collection
type: ConceptGroup
member: global warming debate

effects of climate change
type: Concept
narrower: global warming debate

global warming debate
type: Concept
broader: effects of climate change
definition: Global warming has been a contentious issue of public debate for decades. This societal debate stands in sharp contrast to the relatively strong consensus about the reality and causes of global warming among climate scientists. [Source: Encyclopedia of Global Warming & Climate Change; Global Warming Debate]