concepts
type: Collection
type: ConceptGroup
member: governance indicators

evaluation of governance
type: Concept
narrower: governance indicators

governance indicators
type: Concept
broader: evaluation of governance
definition: Governance indicators quantify the quality of governance in countries. Their use has grown rapidly since the 1990s. [Source: Encyclopedia of Governance; Governance Indicators]