concepts
type: Collection
type: ConceptGroup
member: graffiti art

graffiti art
type: Concept
broader: plastic arts
definition: A drawing, inscription, or stencil made on a wall or other surface usually seen by the public is as old as humankind itself. For instance, ancient Egyptians, Greeks, and Romans used graffiti as a popular medium of expression. [Source: Encyclopedia of Activism and Social Justice; Graffiti Art]

plastic arts
type: Concept
narrower: graffiti art