concepts
type: Collection
type: ConceptGroup
member: harmonization

harmonization
type: Concept
broader: strategies of law enforcement and justice
definition: Harmonization refers to attempts to provide uniformity across diverse jurisdictions. The strengths and limitations of harmonization can be ascertained by examining the pitfalls and benefits associated with such trends. [Source: Encyclopedia of Transnational Crime & Justice; Harmonization]

strategies of law enforcement and justice
type: Concept
narrower: harmonization