concepts
type: Collection
type: ConceptGroup
member: highways

highways
type: Concept
broader: society
definition: Highways are major roads used by the public that connect cities, historic or natural sites, or rural locations. There have been trails or rough roads throughout the world for thousands of years. [Source: Encyclopedia of Environment and Society; Highways]

society
type: Concept
narrower: highways