concepts
type: Collection
type: ConceptGroup
member: hobby horses

hobby horses
type: Concept
broader: toys
definition: A hobby horse is a child's toy composed of a stick with a horse's head at one end. The child straddles the stick horse and “rides.” The hobby horse has links to ancient spring and harvest festivals across Europe. [Source: Encyclopedia of Play in Today's Society; Hobby Horses]

toys
type: Concept
narrower: hobby horses