concepts
type: Collection
type: ConceptGroup
member: housing interventions

homeless service systems
type: Concept
narrower: housing interventions

housing interventions
type: Concept
broader: homeless service systems
definition: Housing interventions—both transitional and permanent—provide housing and services for homeless people, especially those people who have specific needs such as mental health and substance abuse treatment. Transitional Housing Interventions Transitional housing is time limited and typically provides services beyond food, shelter, and clothing. [Source: Encyclopedia of Homelessness; Interventions, Housing]