climate feedback
type: Concept
narrower: ice albedo feedback

concepts
type: Collection
type: ConceptGroup
member: ice albedo feedback

ice albedo feedback
type: Concept
broader: climate feedback
definition: Albedo is an estimate of the reflectivity of a surface. The sun produces solar radiation in wavelengths that can be reflected off of many of the Earth's surfaces, some more so than others. [Source: Encyclopedia of Global Warming & Climate Change; Ice Albedo Feedback]