methods
type: Collection
type: ConceptGroup
member: idiographic methods

idiographic methods
type: Concept
broader: methods, tests and equipment
definition: Introduction Idiographic methods of psychological assessment are techniques designed to capture the unique and potentially idiosyncratic qualities of the individual. The assessor seeks to identify the constellation of psychological attributes that best characterizes the particular individual who is the target of assessment. [Source: Encyclopedia of Psychological Assessment; Idiographic Methods]

methods, tests and equipment
type: Concept
narrower: idiographic methods