concepts
type: Collection
type: ConceptGroup
member: illegitimate opportunity structures

crime and deviance
type: Concept
narrower: illegitimate opportunity structures

illegitimate opportunity structures
type: Concept
broader: crime and deviance
definition: During the 1950s two predominant theories of criminal behavior were Edwin H. Sutherland's differential association theory and Robert K. Merton's anomie theory. Sutherland argued that criminal behavior is learned in the same manner as other behaviors; people who are socialized to sanction criminal behavior are likely to become criminals. [Source: Encyclopedia of Social Problems; Illegitimate Opportunity Structures]