concepts
type: Collection
type: ConceptGroup
member: image interpretation

image interpretation
type: Concept
broader: remote sensing
definition: Image interpretation is the process used in remote sensing to extract meaningful information from photographic and digital images taken of the Earth's surface and atmosphere. The goal is to identify, count, measure, and classify geographic objects or features in the landscape as they are represented by single images or to infer physical geographic processes from two or more images. [Source: Encyclopedia of Geography; Image Interpretation]

remote sensing
type: Concept
narrower: image interpretation