concepts
type: Collection
type: ConceptGroup
member: immigrant adaptation

education and social inequality: race and ethnicity
type: Concept
narrower: immigrant adaptation

immigrant adaptation
type: Concept
broader: education and social inequality: race and ethnicity
definition: The United States has a rich immigrant history. Prior to 1965, most immigrants were of European descent. [Source: Sociology of Education: An A-to-Z Guide; Immigrant Adaptation]