concepts
type: Collection
type: ConceptGroup
member: impacts of global warming

effects of climate change
type: Concept
narrower: impacts of global warming

impacts of global warming
type: Concept
broader: effects of climate change
definition: IMPACTS FROM THE phenomenon known as global warming include environmental, social, and economic effects. Environmental impacts include sea-level rise, melting of the polar ice caps, and an average increase in temperature. [Source: Encyclopedia of Global Warming and Climate Change; Impacts of Global Warming]