concepts
type: Collection
type: ConceptGroup
member: in-kind contributions

donations
type: Concept
narrower: in-kind contributions

in-kind contributions
type: Concept
broader: donations
definition: Nonprofit organizations are often the recipients of inkind contributions as well as monetary contributions. In-kind gifts are noncash transactions that involve goods or services donated by individuals, corporations, and associations. [Source: Encyclopedia of Business Ethics and Society; In-Kind Contributions]