concepts
type: Collection
type: ConceptGroup
member: incest

incest
type: Concept
broader: sexual activity
definition: Incest, sexual intercourse between closely related individuals, has been a taboo in most societies, primitive and modern. The concept of what constitutes close relatives, however, is not uniform among societies. [Source: Encyclopedia of Law & Society: American and Global Perspectives; Incest]

sexual activity
type: Concept
narrower: incest