concepts
type: Collection
type: ConceptGroup
member: inequality and geography

inequality and geography
type: Concept
broader: social geography
definition: Human geographers became directly interested in the study of inequality when the focus of the discipline shifted to examining spatial differences using quantitative methods and exploring how different variables varied across space. Typically, such variations occurred across a country or city, although a few scholars were interested in variations across the globe. [Source: Encyclopedia of Geography; Inequality and Geography]

social geography
type: Concept
narrower: inequality and geography