concepts
type: Collection
type: ConceptGroup
member: information access laws

information access laws
type: Concept
broader: information governance
definition: At its broadest, the family of information access laws may be taken to include all those statutes and regulations that determine who may or may not see information held by organizations—governmental or otherwise. These laws fall within one or more of five categories: 1. [Source: Encyclopedia of Governance; Information Access Laws]

information governance
type: Concept
narrower: information access laws