concepts
type: Collection
type: ConceptGroup
member: informationalism

information governance
type: Concept
narrower: informationalism

informationalism
type: Concept
broader: information governance
definition: All societies are to a certain extent shaped by human activity that produces subjective and objective information—cognition, communication, cooperation, and the informational products produced by these processes can be found in all societies. All labor is based both on mental and manual aspects, that is, on a dialectic of mental labor and manual labor. [Source: Encyclopedia of Governance; Informationalism]