concepts
type: Collection
type: ConceptGroup
member: internationalization school

international business
type: Concept
narrower: internationalization school

internationalization school
type: Concept
broader: international business
definition: Management literature has developed several theories that focus on the activities of business firms in foreign markets. The internationalization school is an important part of this literature. [Source: International Encyclopedia of Organization Studies; Internationalization School]