concepts
type: Collection
type: ConceptGroup
member: internet and computing legislation

information ethics
type: Concept
narrower: internet and computing legislation

internet and computing legislation
type: Concept
broader: information ethics
definition: As a business and public tool, the Internet is in its infancy, especially when compared with other forms of communication technology such as radio, television, and the telephone system. It follows then that the relevant government legislation is also in its infancy and that the regulatory and legislative pace is fast and evolving very quickly. [Source: Encyclopedia of Business Ethics and Society; Internet and Computing Legislation]