concepts
type: Collection
type: ConceptGroup
member: j-curve hypothesis

intergroup relations
type: Concept
narrower: j-curve hypothesis

j-curve hypothesis
type: Concept
broader: intergroup relations
definition: The J-curve hypothesis is one of the best-known theoretical attempts in sociology and political science to specify the conditions under which perceived victims of injustice will rise up against the social system to engage in collective rebellion. First proposed by James C. Davies in 1962, it suggests that social and political unrest is most likely to occur when a prolonged period of improvement in living conditions is followed by a brief but sharp period of decline. [Source: Encyclopedia of Group Processes & Intergroup Relations; J-Curve Hypothesis]