concepts
type: Collection
type: ConceptGroup
member: landless movement

landless movement
type: Concept
broader: political and social movements (Latin America and Caribbean)
definition: The Movement of Landless Rural Workers of Brazil (Movimento dos Trabalhadores Rurais Sem Terra, MST) is the largest and most influential social movement in Latin America. The movement involves an estimated 1.5 million people, with more than 350,000 families living in its settlements across the country. [Source: Encyclopedia of Activism and Social Justice; Landless Movement]

political and social movements (Latin America and Caribbean)
type: Concept
narrower: landless movement