concepts
type: Collection
type: ConceptGroup
member: landscape quality assessment

environment and people
type: Concept
narrower: landscape quality assessment

landscape quality assessment
type: Concept
broader: environment and people
definition: Landscape quality assessment means aesthetic evaluation of an area of Earth's surface. The word landscape originates from the 16th-century Dutch word landschap, which described paintings of inland natural or rural scenery. [Source: Encyclopedia of Geography; Landscape Quality Assessment]