concepts
type: Collection
type: ConceptGroup
member: language defined

language defined
type: Concept
broader: languages and linguistics
definition: To define language is complicated because the definition considers what language does as well as what language is. It is the conduit through which one finds answers to questions about people's identities and experiences. [Source: Encyclopedia of Bilingual Education; Language Defined]

languages and linguistics
type: Concept
narrower: language defined