concepts
type: Collection
type: ConceptGroup
member: lay epistemics

lay epistemics
type: Concept
broader: social cognition
definition: The concept of lay epistemics concerns the process through which individuals (lay persons and scientists alike) attain their subjective knowledge. A theory of lay epistemics has been outlined in two volumes by Arie W. Kruglanski published 15 years apart, and the relevant empirical research has been presented in numerous theoretical and research articles in the scientific literature in personality and social psychology. [Source: Encyclopedia of Social Psychology; Lay Epistemics]

social cognition
type: Concept
narrower: lay epistemics