concepts
type: Collection
type: ConceptGroup
member: leaderless groups

followership
type: Concept
narrower: leaderless groups

leaderless groups
type: Concept
broader: followership
definition: Leaderless groups are those groups that exhibit the absence of formal leadership roles. At least initially, in leaderless groups no individual has responsibility for making sure that the group is progressing toward the achievement of certain goals or actions. [Source: Encyclopedia of Leadership; Leaderless Groups]