concepts
type: Collection
type: ConceptGroup
member: linkage

housing affordability
type: Concept
narrower: linkage

linkage
type: Concept
broader: housing affordability
definition: Linking new business opportunities to corporate strategy. New business opportunities need to be linked to the core business, lest they become resource starved and forgo the opportunity to demonstrate their full potential. [Source: Dictionary of Strategy: Strategic Management A-Z; Linkage]