card games
type: Concept
narrower: loo

concepts
type: Collection
type: ConceptGroup
member: loo

loo
type: Concept
broader: card games
definition: Loo is a card game played with a standard 52-card deck. It was introduced to England in two forms from France around 1660 and was probably relatively new to France at the time. [Source: Encyclopedia of Play in Today's Society; Loo]