concepts
type: Collection
type: ConceptGroup
member: manufacturing yield

manufacturing and operations
type: Concept
narrower: manufacturing yield

manufacturing yield
type: Concept
broader: manufacturing and operations
definition: The yield of a manufacturing process or of any production line is of paramount importance to manufacturers as it is directly related to corporate profitability. For many manufacturing companies, the only alternative to remain competitive is to improve yield. [Source: Encyclopedia of Business in Today's World; Manufacturing Yield]