cartography
type: Concept
narrower: map design

concepts
type: Collection
type: ConceptGroup
member: map design

map design
type: Concept
broader: cartography
definition: Maps remain the primary means of communicating arguments and exploring information in geography. Clear and compelling map design can propel research in geography, while poor design can hinder it. [Source: Encyclopedia of Geography; Map Design]