cartography
type: Concept
narrower: map evaluation and testing

concepts
type: Collection
type: ConceptGroup
member: map evaluation and testing

map evaluation and testing
type: Concept
broader: cartography
definition: A map is an abstraction and simplification of geographic reality to scale, created by selecting the most pertinent information, translating it into graphic symbols, and, usually, projecting it on a flat medium (paper or a computer screen). More maps are now made and used than ever before. [Source: Encyclopedia of Geography; Map Evaluation and Testing]