concepts
type: Collection
type: ConceptGroup
member: market development

market development
type: Concept
broader: marketing
definition: Market development implies seeking out new buyer groups as potential customers for a firm's existing products and services. These customers may be currently served by competitors or may not currently consume such offerings. [Source: Encyclopedia of Business in Today's World; Market Development]

marketing
type: Concept
narrower: market development