concepts
type: Collection
type: ConceptGroup
member: masochism

masochism
type: Concept
broader: paraphilias
definition: the practice of deriving sexual pleasure from having pain inflicted. [Source: The Concise Dictionary of Crime and Justice; Masochism]

paraphilias
type: Concept
narrower: masochism