concepts
type: Collection
type: ConceptGroup
member: mesoregionalism

mesoregionalism
type: Concept
broader: regionalism
definition: The prefix meso is used to describe the middle or intermediate part of a structure or phenomenon. Applied to regionalism, the idea and classification of mesoregionalism and mesoregions cannot be properly understood outside a broader discussion of the emergence of regional economies and regionalist projects as key components of contemporary world order. [Source: Encyclopedia of Governance; Mesoregionalism]

regionalism
type: Concept
narrower: mesoregionalism