methods
type: Collection
type: ConceptGroup
member: microstation

microstation
type: Concept
broader: organizational and institutional aspects
definition: MicroStation is a computer-aided drafting and design (CAD) software developed in the 1980s by Bentley Systems, Inc. This private company was founded in Exton, Pennsylvania, in 1983. [Source: Encyclopedia of Geographic Information Science; Microstation]

organizational and institutional aspects
type: Concept
narrower: microstation