concepts
type: Collection
type: ConceptGroup
member: migrant worker communities

instrumental communities
type: Concept
narrower: migrant worker communities

migrant worker communities
type: Concept
broader: instrumental communities
definition: Migrant worker communities (MWCs) are formed by people who migrate from one country or region to another in search of work. When such migrants go to another country, they typically do so temporarily and do not become citizens of that nation. [Source: Encyclopedia of Community: From the Village to the Virtual World; Migrant Worker Communities]