concepts
type: Collection
type: ConceptGroup
member: mobile home communities

mobile home communities
type: Concept
broader: proximate communities
definition: Mobile home communities, familiarly known as trailer parks, are a community form that emerged in the past fifty years, mainly in the United States. They are permanent sites, unlike the European parks (except perhaps for the U.K.) that have temporary and recreation parks. [Source: Encyclopedia of Community: From the Village to the Virtual World; Mobile Home Communities]

proximate communities
type: Concept
narrower: mobile home communities