concepts
type: Collection
type: ConceptGroup
member: mobile networks

mobile networks
type: Concept
broader: technology and social networking
definition: An array of technologies and hardware, as well as various social networks perpetuated by mobile technologies, make mobile networking possible. Several types of social, cultural, and economic practices and exchanges are enabled and maintained through cell phones, smart phones, laptops, mobile gaming consoles, mobile multimedia players, e-readers, global navigation satellite systems (GNSS), and networked mp3 players. [Source: Encyclopedia of Social Networks; Mobile Networks]

technology and social networking
type: Concept
narrower: mobile networks