concepts
type: Collection
type: ConceptGroup
member: models of policy process

models of policy process
type: Concept
broader: public policy
definition: The term model has multiple meanings. This being so in general, in political science the varying use of the term reflects the diversity of stances on philosophical and methodological issues in this discipline. [Source: International Encyclopedia of Political Science; Policy Process, Models of]

public policy
type: Concept
narrower: models of policy process